{"text_format":"1","workbook":"xlsx","n_sheets":4,"sheets":["Arkusz chroniony","Arkusz2","Arkusz pomocniczy","Tabela miesiące"],"not_rendered":{"charts":0,"images":0,"macros":1,"external_links":0,"defined_names":2,"comments":2,"pivot_tables":0},"unopened":[],"bounds":{"document_bytes":16777216,"sheet_cells":100000,"rows_first":2000,"rows_last":500,"rows_between":2000,"halvings":0,"cell_chars":16384,"cell_head_chars":4096},"cells_cut":0,"cells_raw":0,"read":"whole","date_system":"1900"}

{"sheet":"Arkusz chroniony","index":0,"n_rows":58,"n_cols":35,"rows_kept":58,"cut":false,"hidden":false,"merged":[[8,7,8,9],[21,10,21,12],[19,10,19,12],[0,0,0,22],[14,10,14,12],[13,10,13,12],[15,10,15,12],[16,10,16,12],[17,10,17,12],[16,7,16,9],[24,12,24,13],[17,5,17,6],[18,7,18,9],[19,7,19,9],[20,7,20,9],[20,10,20,12],[8,10,8,12],[9,10,9,12],[10,10,10,12],[11,10,11,12],[12,10,12,12],[24,24,24,25],[24,18,24,19],[8,14,21,22],[18,10,18,12],[24,21,24,22],[24,27,24,28],[24,30,24,31],[24,33,24,34],[10,7,10,9],[11,7,11,9],[12,7,12,9],[21,5,21,9],[21,5,21,9],[19,5,19,6],[24,15,24,16],[8,0,8,1],[8,5,8,6],[13,5,13,6],[14,5,14,6],[15,5,15,6],[16,5,16,6],[10,5,10,6],[11,5,11,6],[12,5,12,6],[5,0,5,16],[13,7,13,9],[24,0,24,1],[24,3,24,4],[18,5,18,6],[20,5,20,6],[24,6,24,7],[14,7,14,9],[24,9,24,10],[17,7,17,9],[6,0,6,16],[2,0,2,16],[3,0,3,16],[4,0,4,16],[15,7,15,9],[1,0,1,22],[10,0,14,1],[10,2,14,3],[9,7,9,9],[9,5,9,6]]}
["Obliczenie danych dotyczących zatrudnienia na potrzeby określenia momentu bazowego"]
["Instrukcja:"]
["1. Należy wskazać miesiąc złożenia wniosku o przyznanie pomocy poprzez wybranie z listy rozwijanej,"]
["2. Następnie należy wprowadzać właściwe dane do pól zaznaczonych kolorem żółtym,"]
["3. W przypadku działalności prowadzonej krócej niż dwanaście miesięcy i rozpoczętej nie z pierwszym dniem danego miesiąca, pola dotyczące  dni, w których nie była jeszcze prowadzona działalność powinny być puste (nie mogą zawierać nawet wartości \"0\"),"]
["4. Dla dni wolnych od pracy należy przyjąć stan z poprzedzającego dnia roboczego, o ile w tym dniu nie została rozwiązana umowa z pracownikiem,"]
["5. W dniach, w którzych przedsiębiorca nie zatrudniał pracowników należy wpisać \"0\" (nie należy tych pól pozostawiać pustych)."]
[]
["Miesiąc złożenia WoPP)",null,null,9,null,"Kolejne miesiące poprzedzające miesiąc złożenia WoPP",null,"Miesiąc",null,null,"Średni poziom zatrudnienia w miesiącu",null,null,null,"Do stanu zatrudnienia nie należy wliczać pracowników przebywających na urlopie: \n• bezpłatnym (kod świadczenia/przerwy 111);\n• macierzyńskim (kod świadczenia/przerwy 311; kod tytułu ubezpieczenia 12 40);\n• bezpłatnym w celu sprawowania opieki nad dzieckiem (np. urlop wychowawczy - kod świadczenia/przerwy 121,122; kod tytułu ubezpieczenia 12 11);\n• bezpłatnym udzielonym pracownikom powołanym do pełnienia określonych funkcji z wyboru \noraz\n• stażystów;\n• osób zatrudnionych w celu przygotowania zawodowego;\n• osób wykonujących pracę na podstawie innej niż umowa o pracę (np. umowy zlecenia lub umowy o dzieło);\n• osób tzw. samozatrudnionych, czyli osób prowadzących działalność gospodarczą oraz osób współpracujących;\n• osób skazanych zatrudnionych na podstawie skierowania do pracy wydanego dyrektora zakładu karnego  (a nie umowy o pracę )."]
[null,null,null,null,null,{"$f":"1","v":1},null,{"$f":"VLOOKUP($D$9+1,'Tabela miesiące'!A2:B37,2,0)","v":"Marzec_2013"},null,null,{"$f":"IF(B58>=0,B58,\"\")","v":0.99999999989999999}]
["Liczba miesięcy                  (w przypadku kiedy podmiot działa krócej niż 12 miesięcy należy wpisać liczbę miesięcy prowadzenia dzialalności)",null,12,null,null,{"$f":"1+F10","v":2},null,{"$f":"VLOOKUP($D$9+2,'Tabela miesiące'!A3:B38,2,0)","v":"Luty_2013"},null,null,{"$f":"IF(E58>=0,E58,\"\")","v":0}]
[null,null,null,null,null,{"$f":"F11+1","v":3},null,{"$f":"VLOOKUP($D$9+3,'Tabela miesiące'!A4:B39,2,0)","v":"Styczeń_2013"},null,null,{"$f":"IF(H58>=0,H58,\"\")","v":0}]
[null,null,null,null,null,{"$f":"F12+1","v":4},null,{"$f":"VLOOKUP($D$9+4,'Tabela miesiące'!A5:B40,2,0)","v":"Grudzień_2012"},null,null,{"$f":"IF(K58>=0,K58,\"\")","v":0}]
[null,null,null,null,null,5,null,{"$f":"VLOOKUP($D$9+5,'Tabela miesiące'!A6:B41,2,0)","v":"Listopad_2012"},null,null,{"$f":"IF(N58>=0,N58,\"\")","v":0}]
[null,null,null,null,null,6,null,{"$f":"VLOOKUP($D$9+6,'Tabela miesiące'!A7:B42,2,0)","v":"Październik_2012"},null,null,{"$f":"IF(Q58>=0,Q58,\"\")","v":0}]
[null,null,null,null,null,7,null,{"$f":"VLOOKUP($D$9+7,'Tabela miesiące'!A8:B43,2,0)","v":"Wrzesień_2012"},null,null,{"$f":"IF(T58>=0,T58,\"\")","v":0}]
[null,null,null,null,null,8,null,{"$f":"VLOOKUP($D$9+8,'Tabela miesiące'!A9:B44,2,0)","v":"Sierpień_2012"},null,null,{"$f":"IF(W58>=0,W58,\"\")","v":0}]
[null,null,null,null,null,9,null,{"$f":"VLOOKUP($D$9+9,'Tabela miesiące'!A10:B45,2,0)","v":"Lipiec_2012"},null,null,{"$f":"IF(Z58>=0,Z58,\"\")","v":0}]
[null,null,null,null,null,10,null,{"$f":"VLOOKUP($D$9+10,'Tabela miesiące'!A11:B46,2,0)","v":"Czerwiec_2012"},null,null,{"$f":"IF(AC58>=0,AC58,\"\")","v":0}]
[null,null,null,null,null,11,null,{"$f":"VLOOKUP($D$9+11,'Tabela miesiące'!A12:B47,2,0)","v":"Maj_2012"},null,null,{"$f":"IF(AF58>=0,AF58,\"\")","v":0}]
[null,null,null,null,null,12,null,{"$f":"VLOOKUP($D$9+12,'Tabela miesiące'!A13:B48,2,0)","v":"Kwiecień_2012"},null,null,{"$f":"IF(AI58>=0,AI58,\"\")","v":0}]
[null,null,null,null,null,"Średnia z okresu 12 miesięcy poprzedzajacych miesiąc złożenia wniosku",null,null,null,null,{"$f":"SUM(K10:M21)/C11","v":8.3333333324999995E-2}]
[]
[]
[{"$f":"H10","v":"Marzec_2013"},null,null,{"$f":"H11","v":"Luty_2013"},null,null,{"$f":"H12","v":"Styczeń_2013"},null,null,{"$f":"H13","v":"Grudzień_2012"},null,null,{"$f":"H14","v":"Listopad_2012"},null,null,{"$f":"H15","v":"Październik_2012"},null,null,{"$f":"H16","v":"Wrzesień_2012"},null,null,{"$f":"H17","v":"Sierpień_2012"},null,null,{"$f":"H18","v":"Lipiec_2012"},null,null,{"$f":"H19","v":"Czerwiec_2012"},null,null,{"$f":"H20","v":"Maj_2012"},null,null,{"$f":"H21","v":"Kwiecień_2012"}]
["Dni w miesiącu","Liczba osób pracujących w poszczególnych dniach miesiąca",null,"Dni w miesiącu","Liczba osób pracujących w poszczególnych dniach miesiąca",null,"Dni w miesiącu","Liczba osób pracujących w poszczególnych dniach miesiąca",null,"Dni w miesiącu","Liczba osób pracujących w poszczególnych dniach miesiąca",null,"Dni w miesiącu","Liczba osób pracujących w poszczególnych dniach miesiąca",null,"Dni w miesiącu","Liczba osób pracujących w poszczególnych dniach miesiąca",null,"Dni w miesiącu","Liczba osób pracujących w poszczególnych dniach miesiąca",null,"Dni w miesiącu","Liczba osób pracujących w poszczególnych dniach miesiąca",null,"Dni w miesiącu","Liczba osób pracujących w poszczególnych dniach miesiąca",null,"Dni w miesiącu","Liczba osób pracujących w poszczególnych dniach miesiąca",null,"Dni w miesiącu","Liczba osób pracujących w poszczególnych dniach miesiąca",null,"Dni w miesiącu","Liczba osób pracujących w poszczególnych dniach miesiąca"]
[{"$f":"IF('Arkusz pomocniczy'!A22<='Arkusz pomocniczy'!B$54,'Arkusz pomocniczy'!A22,\" \")","v":1},1,null,{"$f":"IF('Arkusz pomocniczy'!D22<='Arkusz pomocniczy'!E$54,'Arkusz pomocniczy'!D22,\" \")","v":1},null,null,{"$f":"IF('Arkusz pomocniczy'!G22<='Arkusz pomocniczy'!H$54,'Arkusz pomocniczy'!G22,\" \")","v":1},null,null,{"$f":"IF('Arkusz pomocniczy'!J22<='Arkusz pomocniczy'!K$54,'Arkusz pomocniczy'!J22,\" \")","v":1},null,null,{"$f":"IF('Arkusz pomocniczy'!M22<='Arkusz pomocniczy'!N$54,'Arkusz pomocniczy'!M22,\" \")","v":1},null,null,{"$f":"IF('Arkusz pomocniczy'!P22<='Arkusz pomocniczy'!Q$54,'Arkusz pomocniczy'!P22,\" \")","v":1},null,null,{"$f":"IF('Arkusz pomocniczy'!S22<='Arkusz pomocniczy'!T$54,'Arkusz pomocniczy'!S22,\" \")","v":1},null,null,{"$f":"IF('Arkusz pomocniczy'!V22<='Arkusz pomocniczy'!W$54,'Arkusz pomocniczy'!V22,\" \")","v":1},null,null,{"$f":"IF('Arkusz pomocniczy'!Y22<='Arkusz pomocniczy'!Z$54,'Arkusz pomocniczy'!Y22,\" \")","v":1},null,null,{"$f":"IF('Arkusz pomocniczy'!AB22<='Arkusz pomocniczy'!AC$54,'Arkusz pomocniczy'!AB22,\" \")","v":1},null,null,{"$f":"IF('Arkusz pomocniczy'!AE22<='Arkusz pomocniczy'!AF$54,'Arkusz pomocniczy'!AE22,\" \")","v":1},null,null,{"$f":"IF('Arkusz pomocniczy'!AH22<='Arkusz pomocniczy'!AI$54,'Arkusz pomocniczy'!AH22,\" \")","v":1}]
[{"$f":"IF('Arkusz pomocniczy'!A23<='Arkusz pomocniczy'!B$54,'Arkusz pomocniczy'!A23,\" \")","v":2},null,null,{"$f":"IF('Arkusz pomocniczy'!D23<='Arkusz pomocniczy'!E$54,'Arkusz pomocniczy'!D23,\" \")","v":2},null,null,{"$f":"IF('Arkusz pomocniczy'!G23<='Arkusz pomocniczy'!H$54,'Arkusz pomocniczy'!G23,\" \")","v":2},null,null,{"$f":"IF('Arkusz pomocniczy'!J23<='Arkusz pomocniczy'!K$54,'Arkusz pomocniczy'!J23,\" \")","v":2},null,null,{"$f":"IF('Arkusz pomocniczy'!M23<='Arkusz pomocniczy'!N$54,'Arkusz pomocniczy'!M23,\" \")","v":2},null,null,{"$f":"IF('Arkusz pomocniczy'!P23<='Arkusz pomocniczy'!Q$54,'Arkusz pomocniczy'!P23,\" \")","v":2},null,null,{"$f":"IF('Arkusz pomocniczy'!S23<='Arkusz pomocniczy'!T$54,'Arkusz pomocniczy'!S23,\" \")","v":2},null,null,{"$f":"IF('Arkusz pomocniczy'!V23<='Arkusz pomocniczy'!W$54,'Arkusz pomocniczy'!V23,\" \")","v":2},null,null,{"$f":"IF('Arkusz pomocniczy'!Y23<='Arkusz pomocniczy'!Z$54,'Arkusz pomocniczy'!Y23,\" \")","v":2},null,null,{"$f":"IF('Arkusz pomocniczy'!AB23<='Arkusz pomocniczy'!AC$54,'Arkusz pomocniczy'!AB23,\" \")","v":2},null,null,{"$f":"IF('Arkusz pomocniczy'!AE23<='Arkusz pomocniczy'!AF$54,'Arkusz pomocniczy'!AE23,\" \")","v":2},null,null,{"$f":"IF('Arkusz pomocniczy'!AH23<='Arkusz pomocniczy'!AI$54,'Arkusz pomocniczy'!AH23,\" \")","v":2}]
[{"$f":"IF('Arkusz pomocniczy'!A24<='Arkusz pomocniczy'!B$54,'Arkusz pomocniczy'!A24,\" \")","v":3},null,null,{"$f":"IF('Arkusz pomocniczy'!D24<='Arkusz pomocniczy'!E$54,'Arkusz pomocniczy'!D24,\" \")","v":3},null,null,{"$f":"IF('Arkusz pomocniczy'!G24<='Arkusz pomocniczy'!H$54,'Arkusz pomocniczy'!G24,\" \")","v":3},null,null,{"$f":"IF('Arkusz pomocniczy'!J24<='Arkusz pomocniczy'!K$54,'Arkusz pomocniczy'!J24,\" \")","v":3},null,null,{"$f":"IF('Arkusz pomocniczy'!M24<='Arkusz pomocniczy'!N$54,'Arkusz pomocniczy'!M24,\" \")","v":3},null,null,{"$f":"IF('Arkusz pomocniczy'!P24<='Arkusz pomocniczy'!Q$54,'Arkusz pomocniczy'!P24,\" \")","v":3},null,null,{"$f":"IF('Arkusz pomocniczy'!S24<='Arkusz pomocniczy'!T$54,'Arkusz pomocniczy'!S24,\" \")","v":3},null,null,{"$f":"IF('Arkusz pomocniczy'!V24<='Arkusz pomocniczy'!W$54,'Arkusz pomocniczy'!V24,\" \")","v":3},null,null,{"$f":"IF('Arkusz pomocniczy'!Y24<='Arkusz pomocniczy'!Z$54,'Arkusz pomocniczy'!Y24,\" \")","v":3},null,null,{"$f":"IF('Arkusz pomocniczy'!AB24<='Arkusz pomocniczy'!AC$54,'Arkusz pomocniczy'!AB24,\" \")","v":3},null,null,{"$f":"IF('Arkusz pomocniczy'!AE24<='Arkusz pomocniczy'!AF$54,'Arkusz pomocniczy'!AE24,\" \")","v":3},null,null,{"$f":"IF('Arkusz pomocniczy'!AH24<='Arkusz pomocniczy'!AI$54,'Arkusz pomocniczy'!AH24,\" \")","v":3}]
[{"$f":"IF('Arkusz pomocniczy'!A25<='Arkusz pomocniczy'!B$54,'Arkusz pomocniczy'!A25,\" \")","v":4},null,null,{"$f":"IF('Arkusz pomocniczy'!D25<='Arkusz pomocniczy'!E$54,'Arkusz pomocniczy'!D25,\" \")","v":4},null,null,{"$f":"IF('Arkusz pomocniczy'!G25<='Arkusz pomocniczy'!H$54,'Arkusz pomocniczy'!G25,\" \")","v":4},null,null,{"$f":"IF('Arkusz pomocniczy'!J25<='Arkusz pomocniczy'!K$54,'Arkusz pomocniczy'!J25,\" \")","v":4},null,null,{"$f":"IF('Arkusz pomocniczy'!M25<='Arkusz pomocniczy'!N$54,'Arkusz pomocniczy'!M25,\" \")","v":4},null,null,{"$f":"IF('Arkusz pomocniczy'!P25<='Arkusz pomocniczy'!Q$54,'Arkusz pomocniczy'!P25,\" \")","v":4},null,null,{"$f":"IF('Arkusz pomocniczy'!S25<='Arkusz pomocniczy'!T$54,'Arkusz pomocniczy'!S25,\" \")","v":4},null,null,{"$f":"IF('Arkusz pomocniczy'!V25<='Arkusz pomocniczy'!W$54,'Arkusz pomocniczy'!V25,\" \")","v":4},null,null,{"$f":"IF('Arkusz pomocniczy'!Y25<='Arkusz pomocniczy'!Z$54,'Arkusz pomocniczy'!Y25,\" \")","v":4},null,null,{"$f":"IF('Arkusz pomocniczy'!AB25<='Arkusz pomocniczy'!AC$54,'Arkusz pomocniczy'!AB25,\" \")","v":4},null,null,{"$f":"IF('Arkusz pomocniczy'!AE25<='Arkusz pomocniczy'!AF$54,'Arkusz pomocniczy'!AE25,\" \")","v":4},null,null,{"$f":"IF('Arkusz pomocniczy'!AH25<='Arkusz pomocniczy'!AI$54,'Arkusz pomocniczy'!AH25,\" \")","v":4}]
{"$rows_left_out":29}
{"sheet":"Arkusz2","index":1,"n_rows":0,"n_cols":0,"rows_kept":0,"cut":false,"hidden":true,"merged":[]}

{"sheet":"Arkusz pomocniczy","index":2,"n_rows":58,"n_cols":35,"rows_kept":58,"cut":false,"hidden":true,"merged":[[19,33,19,34],[54,0,55,21],[19,15,19,16],[19,18,19,19],[19,21,19,22],[19,24,19,25],[19,27,19,28],[19,30,19,31],[16,5,16,9],[16,10,16,12],[19,0,19,1],[19,3,19,4],[19,6,19,7],[19,9,19,10],[19,12,19,13],[14,5,14,6],[14,7,14,9],[14,10,14,12],[15,5,15,6],[15,7,15,9],[15,10,15,12],[12,5,12,6],[12,7,12,9],[12,10,12,12],[13,5,13,6],[13,7,13,9],[13,10,13,12],[10,5,10,6],[10,7,10,9],[10,10,10,12],[11,5,11,6],[11,7,11,9],[11,10,11,12],[7,10,7,12],[8,5,8,6],[8,7,8,9],[8,10,8,12],[9,5,9,6],[9,7,9,9],[9,10,9,12],[5,0,9,1],[5,2,9,3],[5,5,5,6],[5,7,5,9],[5,10,5,12],[6,5,6,6],[6,7,6,9],[6,10,6,12],[7,5,7,6],[7,7,7,9],[0,0,0,22],[1,0,1,22],[3,0,3,1],[3,5,3,6],[3,7,3,9],[3,10,3,12],[3,14,16,22],[4,5,4,6],[4,7,4,9],[4,10,4,12]]}
["Obliczenie danych dotyczących zatrudnienia na potrzeby określenia momentu bazowego"]
["Należy wypełniać jedynie pola oznaczone kolorem żółtym "]
[]
["Miesiąc złożenia WoPP)",null,null,1,null,"Kolejne miesiące poprzedzające miesiąc złożenia WoPP",null,"Miesiąc",null,null,"Średni poziom zatrudnienia w miesiącu",null,null,null,"Do stanu zatrudnienia nie należy wliczać pracowników przebywających na urlopie: \n• bezpłatnym (kod świadczenia/przerwy 111);\n• macierzyńskim (kod świadczenia/przerwy 311; kod tytułu ubezpieczenia 12 40);\n• bezpłatnym w celu sprawowania opieki nad dzieckiem (np. urlop wychowawczy - kod świadczenia/przerwy 121,122; kod tytułu ubezpieczenia 12 11);\n• bezpłatnym udzielonym pracownikom powołanym do pełnienia określonych funkcji z wyboru \noraz\n• stażystów;\n• osób zatrudnionych w celu przygotowania zawodowego;\n• osób wykonujących pracę na podstawie innej niż umowa o pracę (np. umowy zlecenia lub umowy o dzieło);\n• osób tzw. samozatrudnionych, czyli osób prowadzących działalność gospodarczą oraz osób współpracujących;\n• osób skazanych zatrudnionych na podstawie skierowania do pracy wydanego dyrektora zakładu karnego  (a nie umowy o pracę )."]
[null,null,null,null,null,{"$f":"1","v":1},null,{"$f":"'Arkusz chroniony'!H10:J10","v":"Marzec_2013"},null,null,{"$f":"B53","v":0}]
["Liczba miesięcy        (w przypadku kiedy podmiot działa krócej niż 12 miesięcy należy wpisać liczbę miesięcy prowadzenia dzialalności)",null,12,null,null,{"$f":"1+F5","v":2},null,{"$f":"'Arkusz chroniony'!H11:J11","v":"Luty_2013"},null,null,{"$f":"E53","v":0}]
[null,null,null,null,null,{"$f":"F6+1","v":3},null,{"$f":"'Arkusz chroniony'!H12:J12","v":"Styczeń_2013"},null,null,{"$f":"H53","v":0}]
[null,null,null,null,null,{"$f":"F7+1","v":4},null,{"$f":"'Arkusz chroniony'!H13:J13","v":"Grudzień_2012"},null,null,{"$f":"K53","v":0}]
[null,null,null,null,null,5,null,{"$f":"'Arkusz chroniony'!H14:J14","v":"Listopad_2012"},null,null,{"$f":"N53","v":0}]
[null,null,null,null,null,6,null,{"$f":"'Arkusz chroniony'!H15:J15","v":"Październik_2012"},null,null,{"$f":"Q53","v":0}]
[null,null,null,null,null,7,null,{"$f":"'Arkusz chroniony'!H16:J16","v":"Wrzesień_2012"},null,null,{"$f":"T53","v":0}]
[null,null,null,null,null,8,null,{"$f":"'Arkusz chroniony'!H17:J17","v":"Sierpień_2012"},null,null,{"$f":"W53","v":0}]
[null,null,null,null,null,9,null,{"$f":"'Arkusz chroniony'!H18:J18","v":"Lipiec_2012"},null,null,{"$f":"Z53","v":0}]
[null,null,null,null,null,10,null,{"$f":"'Arkusz chroniony'!H19:J19","v":"Czerwiec_2012"},null,null,{"$f":"AC53","v":0}]
[null,null,null,null,null,11,null,{"$f":"'Arkusz chroniony'!H20:J20","v":"Maj_2012"},null,null,{"$f":"AF53","v":0}]
[null,null,null,null,null,12,null,{"$f":"'Arkusz chroniony'!H21:J21","v":"Kwiecień_2012"},null,null,{"$f":"AI53","v":0}]
[null,null,null,null,null,"Średnia z okresu 12 miesięcy poprzedzajacych miesiąc złożenia wniosku",null,null,null,null,{"$f":"SUM(K5:M16)/C6","v":0}]
[]
[]
[{"$f":"H5","v":"Marzec_2013"},null,null,{"$f":"H6","v":"Luty_2013"},null,null,{"$f":"H7","v":"Styczeń_2013"},null,null,{"$f":"H8","v":"Grudzień_2012"},null,null,{"$f":"H9","v":"Listopad_2012"},null,null,{"$f":"H10","v":"Październik_2012"},null,null,{"$f":"H11","v":"Wrzesień_2012"},null,null,{"$f":"H12","v":"Sierpień_2012"},null,null,{"$f":"H13","v":"Lipiec_2012"},null,null,{"$f":"H14","v":"Czerwiec_2012"},null,null,{"$f":"H15","v":"Maj_2012"},null,null,{"$f":"H16","v":"Kwiecień_2012"}]
["Dni w miesiącu","Liczba osób pracujących w poszczególnych dniach miesiąca",null,"Dni w miesiącu","Liczba osób pracujących w poszczególnych dniach miesiąca",null,"Dni w miesiącu","Liczba osób pracujących w poszczególnych dniach miesiąca",null,"Dni w miesiącu","Liczba osób pracujących w poszczególnych dniach miesiąca",null,"Dni w miesiącu","Liczba osób pracujących w poszczególnych dniach miesiąca",null,"Dni w miesiącu","Liczba osób pracujących w poszczególnych dniach miesiąca",null,"Dni w miesiącu","Liczba osób pracujących w poszczególnych dniach miesiąca",null,"Dni w miesiącu","Liczba osób pracujących w poszczególnych dniach miesiąca",null,"Dni w miesiącu","Liczba osób pracujących w poszczególnych dniach miesiąca",null,"Dni w miesiącu","Liczba osób pracujących w poszczególnych dniach miesiąca",null,"Dni w miesiącu","Liczba osób pracujących w poszczególnych dniach miesiąca",null,"Dni w miesiącu","Liczba osób pracujących w poszczególnych dniach miesiąca"]
[1,null,null,1,null,null,1,null,null,1,null,null,1,null,null,1,null,null,1,null,null,1,null,null,1,null,null,1,null,null,1,null,null,1]
[2,null,null,2,null,null,2,null,null,2,null,null,2,null,null,2,null,null,2,null,null,2,null,null,2,null,null,2,null,null,2,null,null,2]
[3,null,null,3,null,null,3,null,null,3,null,null,3,null,null,3,null,null,3,null,null,3,null,null,3,null,null,3,null,null,3,null,null,3]
[4,null,null,4,null,null,4,null,null,4,null,null,4,null,null,4,null,null,4,null,null,4,null,null,4,null,null,4,null,null,4,null,null,4]
[5,null,null,5,null,null,5,null,null,5,null,null,5,null,null,5,null,null,5,null,null,5,null,null,5,null,null,5,null,null,5,null,null,5]
[6,null,null,6,null,null,6,null,null,6,null,null,6,null,null,6,null,null,6,null,null,6,null,null,6,null,null,6,null,null,6,null,null,6]
[7,null,null,7,null,null,7,null,null,7,null,null,7,null,null,7,null,null,7,null,null,7,null,null,7,null,null,7,null,null,7,null,null,7]
[8,null,null,8,null,null,8,null,null,8,null,null,8,null,null,8,null,null,8,null,null,8,null,null,8,null,null,8,null,null,8,null,null,8]
[9,null,null,9,null,null,9,null,null,9,null,null,9,null,null,9,null,null,9,null,null,9,null,null,9,null,null,9,null,null,9,null,null,9]
{"$rows_left_out":29}
{"sheet":"Tabela miesiące","index":3,"n_rows":37,"n_cols":3,"rows_kept":37,"cut":false,"hidden":true,"merged":[]}
["Lp.","Miesiąc","Liczba dni"]
[1,"Grudzień_2013",31]
[2,"Listopad_2013",30]
[3,"Październik_2013",31]
[4,"Wrzesień_2013",30]
[5,"Sierpień_2013",31]
[6,"Lipiec_2013",31]
[7,"Czerwiec_2013",30]
[8,"Maj_2013",31]
[9,"Kwiecień_2013",30]
[10,"Marzec_2013",31]
[11,"Luty_2013",28]
[12,"Styczeń_2013",31]
[13,"Grudzień_2012",31]
[14,"Listopad_2012",30]
[15,"Październik_2012",31]
[16,"Wrzesień_2012",30]
[17,"Sierpień_2012",31]
[18,"Lipiec_2012",31]
[19,"Czerwiec_2012",30]
[20,"Maj_2012",31]
[21,"Kwiecień_2012",30]
[22,"Marzec_2012",31]
[23,"Luty_2012",28]
[24,"Styczeń_2012",31]
[25,"Grudzień_2011",31]
[26,"Listopad_2011",30]
[27,"Październik_2011",31]
[28,"Wrzesień_2011",30]
[29,"Sierpień_2011",31]
{"$rows_left_out":7}